{"text_format":"1","workbook":"xlsx","n_sheets":7,"sheets":["menu","input","allocazione costi alle attività","ribaltamento attività ai prod.","costo prodotti","bill of activities","costo per gerarchia di attività"],"not_rendered":{"charts":0,"images":0,"macros":1,"external_links":0,"defined_names":0,"comments":0,"pivot_tables":0},"unopened":[],"bounds":{"document_bytes":16777216,"sheet_cells":100000,"rows_first":2000,"rows_last":500,"rows_between":2000,"halvings":0,"cell_chars":16384,"cell_head_chars":4096},"cells_cut":0,"cells_raw":0,"read":"whole","date_system":"1900"}

{"sheet":"menu","index":0,"n_rows":0,"n_cols":0,"rows_kept":0,"cut":false,"hidden":false,"merged":[]}

{"sheet":"input","index":1,"n_rows":72,"n_cols":8,"rows_kept":72,"cut":false,"hidden":false,"merged":[[64,1,66,1],[67,1,70,1]]}
[]
[]
[]
[]
[]
[]
[]
[null,"Voce di costo","Importo","Criteri di allocazione"]
[null,"Costi diretti"]
[null,"Materie prime dirette",1000000,"Diretti sui prodotti"]
[null,"Lavoro diretto",500000,"Diretti sui prodotti"]
[null,"Costi indiretti"]
[null,"Salari e stipendi al personale indiretto",650000,"Ore dedicate"]
[null,"Riscaldamento ed illuminazione",131100,"Metri quadrati occupati"]
[null,"Affitto locali",45600,"Metri quadrati occupati"]
[null,"Ammortamento attrezzature",384000,"Ore macchina"]
[null,"Vigilanza e pulizia",27000,"n. stanze"]
[null,"Energia impianti",160000,"Diretti sui prodotti (ore macchina)"]
[null,null,{"$f":"SUM(C13:C18)","v":1397700}]
[]
[]
[null,"Voci di costo/attività","Controllo qualità","Movimentazione materiali","Set up","Approvvigionamento","Specifiche di produzione","Totale"]
[null,"Salari e stipendi al personale indiretto",600,900,1500,2500,1000,6500]
[null,"Riscaldamento e illuminazione",50,250,100,90,80,570]
[null,"Affitto locali",50,250,100,90,80,570]
[null,"Ammortamento attrezzature",240,680,80,350,250,1600]
[null,"Vigilanza e pulizia",1,3,1,2,2,9]
[]
[]
[]
[]
[]
[]
[]
[]
[null,"Attività","Cost driver"]
[null,"Controllo qualità","n. ispezioni"]
[null,"Movimentazione materiali","n. movimentazione di materiali"]
[null,"Set up","n. set up"]
[null,"Approvvigionamento","n. ordini di acquisto"]
[null,"Specifiche di produzione","n. specifiche di produzione"]
[]
[]
[null,"Cost drivers/prodotti","Dido","Dado","Totale"]
[null,"n. ispezioni",400,350,750]
[null,"n. movimentazione di materiali",800,700,1500]
[null,"n. set up",15,90,105]
[null,"n. ordini di acquisto",120,230,350]
[null,"n. specifiche di produzione",50,75,125]
[]
[]
[]
[]
[]
[]
[]
[]
[null,null,"Dido","Dado","totale"]
[null,"Materie prime dirette",343000,657000,{"$f":"SUM(C59:D59)","v":1000000}]
[null,"Lavoro diretto",365500,134500,500000]
[null,"Volume di produzione",120000,72000,192000]
[null,"ore macchina",950,650,1600]
[]
[]
[null,"unità","materie prime"]
[null,null,"lavoro diretto"]
[null,null,"energia impianti"]
[null,"lotto","controllo qualità "]
[null,null,"movimentazione materiali"]
[null,null,"setup"]
[null,null,"approvvigionamenti"]
[null,"prodotto","specifiche di produzione"]

{"sheet":"allocazione costi alle attività","index":2,"n_rows":15,"n_cols":8,"rows_kept":15,"cut":false,"hidden":false,"merged":[]}
[]
[]
[]
[]
[]
[]
[]
[]
["Voci di costo/attività","Controllo qualità","Movimentazione materiali","Set up","Approvvigionamento","Specifiche di produzione","Totale","controllo"]
["Salari e stipendi al personale indiretto",{"$f":"(input!$C$13/input!$H$23)*input!C23","v":60000},{"$f":"(input!$C$13/input!$H$23)*input!D23","v":90000},{"$f":"(input!$C$13/input!$H$23)*input!E23","v":150000},{"$f":"(input!$C$13/input!$H$23)*input!F23","v":250000},{"$f":"(input!$C$13/input!$H$23)*input!G23","v":100000},{"$f":"SUM(B10:F10)","v":650000},{"$f":"IF(G10-input!C13=0, \"ok\", \"allarme\")","v":"ok"}]
["Riscaldamento e illuminazione",{"$f":"(input!$C$14/input!$H$24)*input!C24","v":11500},{"$f":"(input!$C$14/input!$H$24)*input!D24","v":57500},{"$f":"(input!$C$14/input!$H$24)*input!E24","v":23000},{"$f":"(input!$C$14/input!$H$24)*input!F24","v":20700},{"$f":"(input!$C$14/input!$H$24)*input!G24","v":18400},131100,{"$f":"IF(G11-input!C14=0, \"ok\", \"allarme\")","v":"ok"}]
["Affitto locali",{"$f":"(input!$C$15/input!$H$25)*input!C25","v":4000},{"$f":"(input!$C$15/input!$H$25)*input!D25","v":20000},{"$f":"(input!$C$15/input!$H$25)*input!E25","v":8000},{"$f":"(input!$C$15/input!$H$25)*input!F25","v":7200},{"$f":"(input!$C$15/input!$H$25)*input!G25","v":6400},45600,{"$f":"IF(G12-input!C15=0, \"ok\", \"allarme\")","v":"ok"}]
["Ammortamento attrezzature",{"$f":"(input!$C$16/input!$H$26)*input!C26","v":57600},{"$f":"(input!$C$16/input!$H$26)*input!D26","v":163200},{"$f":"(input!$C$16/input!$H$26)*input!E26","v":19200},{"$f":"(input!$C$16/input!$H$26)*input!F26","v":84000},{"$f":"(input!$C$16/input!$H$26)*input!G26","v":60000},384000,{"$f":"IF(G13-input!C16=0, \"ok\", \"allarme\")","v":"ok"}]
["Vigilanza e pulizia",{"$f":"(input!$C$17/input!$H$27)*input!C27","v":3000},{"$f":"(input!$C$17/input!$H$27)*input!D27","v":9000},{"$f":"(input!$C$17/input!$H$27)*input!E27","v":3000},{"$f":"(input!$C$17/input!$H$27)*input!F27","v":6000},{"$f":"(input!$C$17/input!$H$27)*input!G27","v":6000},27000,{"$f":"IF(G14-input!C17=0, \"ok\", \"allarme\")","v":"ok"}]
[null,{"$f":"SUM(B10:B14)","v":136100},339700,203200,367900,190800,1237700,{"$f":"IF(G15-SUM(input!C13:C17)=0, \"ok\", \"allarme\")","v":"ok"}]

{"sheet":"ribaltamento attività ai prod.","index":3,"n_rows":14,"n_cols":6,"rows_kept":14,"cut":false,"hidden":false,"merged":[]}
[]
[]
[]
[]
[]
[]
[]
[null,"Cost drivers/prodotti","Dido","Dado","Totale","Controllo"]
[null,"Controllo qualità",{"$f":"('allocazione costi alle attività'!$B$15/input!$E$45)*input!C45","v":72586.666666666672},{"$f":"('allocazione costi alle attività'!$B$15/input!$E$45)*input!D45","v":63513.333333333336},{"$f":"SUM(C9:D9)","v":136100},{"$f":"IF(E9-'allocazione costi alle attività'!B15=0,\"ok\",\"allarme\")","v":"ok"}]
[null,"Movimentazione materiali",{"$f":"('allocazione costi alle attività'!$C$15/input!$E$46)*input!C46","v":181173.33333333334},{"$f":"('allocazione costi alle attività'!$C$15/input!$E$46)*input!D46","v":158526.66666666666},{"$f":"SUM(C10:D10)","v":339700},{"$f":"IF(E10-'allocazione costi alle attività'!C15=0,\"ok\",\"allarme\")","v":"ok"}]
[null,"Set up",{"$f":"('allocazione costi alle attività'!$D$15/input!$E$47)*input!C47","v":29028.571428571428},{"$f":"('allocazione costi alle attività'!$D$15/input!$E$47)*input!D47","v":174171.42857142858},{"$f":"SUM(C11:D11)","v":203200},{"$f":"IF(E11-'allocazione costi alle attività'!D15=0,\"ok\",\"allarme\")","v":"ok"}]
[null,"Approvvigionamento",{"$f":"('allocazione costi alle attività'!$E$15/input!$E$48)*input!C48","v":126137.14285714286},{"$f":"('allocazione costi alle attività'!$E$15/input!$E$48)*input!D48","v":241762.85714285713},{"$f":"SUM(C12:D12)","v":367900},{"$f":"IF(E12-'allocazione costi alle attività'!E15=0,\"ok\",\"allarme\")","v":"ok"}]
[null,"Specifiche di produzione",{"$f":"('allocazione costi alle attività'!$F$15/input!$E$49)*input!C49","v":76320},{"$f":"('allocazione costi alle attività'!$F$15/input!$E$49)*input!D49","v":114480},190800,{"$f":"IF(E13-'allocazione costi alle attività'!F15=0,\"ok\",\"allarme\")","v":"ok"}]
[null,null,{"$f":"SUM(C9:C13)","v":485245.71428571426},752454.28571428568,{"$f":"SUM(E9:E13)","v":1237700},{"$f":"IF(E14-'allocazione costi alle attività'!G15=0,\"ok\",\"allarme\")","v":"ok"}]

{"sheet":"costo prodotti","index":4,"n_rows":16,"n_cols":4,"rows_kept":16,"cut":false,"hidden":false,"merged":[]}
[]
[]
[]
[]
[]
[]
[]
[]
[null,"Costi diretti/indiretti","Dido","Dado"]
[null,"Materie prime dirette",343000,657000]
[null,"Lavoro diretto",365500,134500]
[null,"energia impianti",{"$f":"input!C18/input!E62*input!C62","v":95000},{"$f":"input!C18/input!E62*input!D62","v":65000}]
[null,"costi indiretti",{"$f":"'ribaltamento attività ai prod.'!C14","v":485245.71428571426},{"$f":"'ribaltamento attività ai prod.'!D14","v":752454.28571428568}]
[null,"totale",{"$f":"SUM(C10:C13)","v":1288745.7142857143},1608954.2857142857]
[null,"Volume di produzione",120000,72000]
[null,"Costo unitario",{"$f":"C14/C15","v":10.739547619047618},22.346587301587302]

{"sheet":"bill of activities","index":5,"n_rows":18,"n_cols":8,"rows_kept":18,"cut":false,"hidden":false,"merged":[[7,2,7,4],[7,5,7,7]]}
[]
[]
[]
[]
[]
[]
[]
[null,null,"Dido",null,null,"Dado"]
[null,"Costi diretti/attività","totali","unitari","%","totali","unitari","%"]
[null,"materie prime",{"$f":"'costo prodotti'!C10","v":343000},{"$f":"C10/'costo prodotti'!$C$15","v":2.8583333333333334},{"$f":"C10/$C$18","v":0.26615025462188041},{"$f":"'costo prodotti'!D10","v":657000},{"$f":"F10/'costo prodotti'!$D$15","v":9.125},{"$f":"F10/$F$18","v":0.40833975572421483}]
[null,"lavoro diretto",{"$f":"'costo prodotti'!C11","v":365500},{"$f":"C11/'costo prodotti'!$C$15","v":3.0458333333333334},0.28360909056646438,{"$f":"'costo prodotti'!D11","v":134500},{"$f":"F11/'costo prodotti'!$D$15","v":1.8680555555555556},8.3594668409295123E-2]
[null,"energia impianti",{"$f":"'costo prodotti'!C12","v":95000},{"$f":"C12/'costo prodotti'!$C$15","v":0.79166666666666663},7.3715085099354635E-2,{"$f":"'costo prodotti'!D12","v":65000},{"$f":"F12/'costo prodotti'!$D$15","v":0.90277777777777779},4.0398910383674227E-2]
[null,"controllo qualità",{"$f":"'ribaltamento attività ai prod.'!C9","v":72586.666666666672},{"$f":"C13/'costo prodotti'!$C$15","v":0.60488888888888892},5.632349800433497E-2,{"$f":"'ribaltamento attività ai prod.'!D9","v":63513.333333333336},{"$f":"F13/'costo prodotti'!$D$15","v":0.88212962962962971},3.9474914792334802E-2]
[null,"movimentazione materiali",{"$f":"'ribaltamento attività ai prod.'!C10","v":181173.33333333334},{"$f":"C14/'costo prodotti'!$C$15","v":1.5097777777777779},0.14058113352000431,{"$f":"'ribaltamento attività ai prod.'!D10","v":158526.66666666666},{"$f":"F14/'costo prodotti'!$D$15","v":2.201759259259259},9.8527763078296346E-2]
[null,"set up",{"$f":"'ribaltamento attività ai prod.'!C11","v":29028.571428571428},{"$f":"C15/'costo prodotti'!$C$15","v":0.2419047619047619},2.2524669612314075E-2,{"$f":"'ribaltamento attività ai prod.'!D11","v":174171.42857142858},{"$f":"F15/'costo prodotti'!$D$15","v":2.4190476190476193},0.10825132206544091]
[null,"approvvigionamenti",{"$f":"'ribaltamento attività ai prod.'!C12","v":126137.14285714286},{"$f":"C16/'costo prodotti'!$C$15","v":1.0511428571428572},9.7875897051618296E-2,{"$f":"'ribaltamento attività ai prod.'!D12","v":241762.85714285713},{"$f":"F16/'costo prodotti'!$D$15","v":3.35781746031746},0.15026086153562029]
[null,"specifiche di produzione",{"$f":"'ribaltamento attività ai prod.'!C13","v":76320},{"$f":"C17/'costo prodotti'!$C$15","v":0.63600000000000001},5.9220371524028897E-2,{"$f":"'ribaltamento attività ai prod.'!D13","v":114480},{"$f":"F17/'costo prodotti'!$D$15","v":1.59},7.1151804011123462E-2]
[null,"Totale",{"$f":"SUM(C10:C17)","v":1288745.7142857143},null,{"$f":"SUM(E10:E17)","v":1},1608954.2857142857,null,{"$f":"SUM(H10:H17)","v":1}]

{"sheet":"costo per gerarchia di attività","index":6,"n_rows":23,"n_cols":9,"rows_kept":23,"cut":false,"hidden":false,"merged":[[7,3,7,5],[7,6,7,8]]}
[]
[]
[]
[]
[]
[]
[]
[null,null,"costi totali","dido",null,null,"dado"]
[null,null,null,"totale","unitario ","%","totale","unitario ","%"]
[null,"Unità"]
[null,"materie dirette",{"$f":"input!C10","v":1000000},{"$f":"'costo prodotti'!C10","v":343000},{"$f":"D11/'costo prodotti'!$C$15","v":2.8583333333333334},{"$f":"D11/$D$23","v":0.26615025462188041},{"$f":"'costo prodotti'!D10","v":657000},{"$f":"G11/'costo prodotti'!$D$15","v":9.125},{"$f":"G11/$G$23","v":0.40833975572421483}]
[null,"lavoro diretto",{"$f":"input!C11","v":500000},{"$f":"'costo prodotti'!C11","v":365500},{"$f":"D12/'costo prodotti'!$C$15","v":3.0458333333333334},0.28360909056646438,{"$f":"'costo prodotti'!D11","v":134500},{"$f":"G12/'costo prodotti'!$D$15","v":1.8680555555555556},8.3594668409295123E-2]
[null,"energia impianti",{"$f":"input!C18","v":160000},{"$f":"'costo prodotti'!C12","v":95000},{"$f":"D13/'costo prodotti'!$C$15","v":0.79166666666666663},7.3715085099354635E-2,{"$f":"'costo prodotti'!D12","v":65000},{"$f":"G13/'costo prodotti'!$D$15","v":0.90277777777777779},4.0398910383674227E-2]
[null,"totale",{"$f":"SUM(C11:C13)","v":1660000},803500,6.6958333333333337,0.62347443028769944,{"$f":"SUM(G11:G13)","v":856500},{"$f":"G14/'costo prodotti'!$D$15","v":11.895833333333334},0.53233333451718423]
[null,"Lotto",null,null,null,0]
[null,"controllo qualità",{"$f":"'ribaltamento attività ai prod.'!E9","v":136100},{"$f":"'ribaltamento attività ai prod.'!C9","v":72586.666666666672},{"$f":"D16/'costo prodotti'!$C$15","v":0.60488888888888892},5.632349800433497E-2,{"$f":"'ribaltamento attività ai prod.'!D9","v":63513.333333333336},{"$f":"G16/'costo prodotti'!$D$15","v":0.88212962962962971},{"$f":"G16/$G$23","v":3.9474914792334802E-2}]
[null,"movimentazione materiali",{"$f":"'ribaltamento attività ai prod.'!E10","v":339700},{"$f":"'ribaltamento attività ai prod.'!C10","v":181173.33333333334},{"$f":"D17/'costo prodotti'!$C$15","v":1.5097777777777779},0.14058113352000431,{"$f":"'ribaltamento attività ai prod.'!D10","v":158526.66666666666},{"$f":"G17/'costo prodotti'!$D$15","v":2.201759259259259},9.8527763078296346E-2]
[null,"set up",{"$f":"'ribaltamento attività ai prod.'!E11","v":203200},{"$f":"'ribaltamento attività ai prod.'!C11","v":29028.571428571428},{"$f":"D18/'costo prodotti'!$C$15","v":0.2419047619047619},2.2524669612314075E-2,{"$f":"'ribaltamento attività ai prod.'!D11","v":174171.42857142858},{"$f":"G18/'costo prodotti'!$D$15","v":2.4190476190476193},0.10825132206544091]
[null,"approvvigionamenti",{"$f":"'ribaltamento attività ai prod.'!E12","v":367900},{"$f":"'ribaltamento attività ai prod.'!C12","v":126137.14285714286},{"$f":"D19/'costo prodotti'!$C$15","v":1.0511428571428572},9.7875897051618296E-2,{"$f":"'ribaltamento attività ai prod.'!D12","v":241762.85714285713},{"$f":"G19/'costo prodotti'!$D$15","v":3.35781746031746},0.15026086153562029]
[null,"totale",{"$f":"SUM(C16:C19)","v":1046900},408925.71428571426,3.4077142857142859,0.31730519818827163,{"$f":"SUM(G16:G19)","v":637974.28571428568},{"$f":"G20/'costo prodotti'!$D$15","v":8.8607539682539684},0.39651486147169235]
[null,"Prodotto",null,null,null,0]
[null,"specifiche di prodotto",{"$f":"'ribaltamento attività ai prod.'!E13","v":190800},{"$f":"'ribaltamento attività ai prod.'!C13","v":76320},{"$f":"D22/'costo prodotti'!$C$15","v":0.63600000000000001},5.9220371524028897E-2,{"$f":"'ribaltamento attività ai prod.'!D13","v":114480},{"$f":"G22/'costo prodotti'!$D$15","v":1.59},{"$f":"G22/$G$23","v":7.1151804011123462E-2}]
[null,"totale",{"$f":"C14+C20+C22","v":2897700},1288745.7142857143,10.739547619047618,1,{"$f":"G14+G20+G22","v":1608954.2857142857},{"$f":"G23/'costo prodotti'!$D$15","v":22.346587301587302},1]